En İyi Videolar
En Çok Arananlar
Son Görüntülenenler
Ruh Halleri ve Türler
Autumn
Chill
Commute
Energize
Feel good
Focus
Gaming
Party
Romance
Sad
Sleep
Summer
Winter
Workout
African
Arabic
Blues
Bollywood & Indian
Classical
Country & Americana
Dance & electronic
Decades
Family
Folk & acoustic
German hip-hop
German pop
Hip-hop
Indie & alternative
J-Pop
Jazz
K-Pop
Latin
Mandopop & cantopop
Metal
Pop
R&B & soul
Reggae & caribbean
Rock
Schlager
Soundtracks & musicals
Hesabım
Giriş Yap
Oynatma Listelerim
İstatistiklerim
Yükle
Blog
Solving the React Native Build Failed Error
1:48
|
Video işleniyor...
Yükleniyor...
İndir
Sonraki Video
Fixing React Native iOS Build Error: node: No such file or directory in PhaseScriptExecution
2:55
|
İlgili Videolar
3:18
Fix Gradle Errors in React Native | Step-by-Step Guide
3:03
Fixing Gradle build failed Error in React Native with EAS Build for Android
3:33
[Fixed] Gradle build failed with unknown error in Expo/React Native
1:39
Solving the Build Failed Error on iOS When Rebuilding React Native Projects
3:14
Solved: React Native Build Failed | Reanimated & Gradle Lock Issue Fixed!
2:55
Fixing React Native iOS Build Error: node: No such file or directory in PhaseScriptExecution
2:05
Solving the BUILD FAILED Issue in React Native When Integrating Firebase for iOS Apps
3:23
Error Resolving Plugin - id: 'com.facebook.react.settings | React Native CLI Gradle Build Failed
3:47
How to Fix app:compileDebugJavaWithJavac FAILED Error in React Native Project?
3:35
Fixing the no rule to process file 'main.jsbundle' Error in Xcode 16 for React Native iOS Builds
2:47
STOP Wasting Time on Gradle Errors in React Native! | 100% Resolved Gradle issue in React Native
4:49
React Native 0.83.1 New Project Not Running? 🔥 Fix in 5 Minutes (NDK Issue)
2:53
react-native-svg Build Issue in React Native 0.78: How to Fix the C+ + Build System Error
1:50
How to Resolve the EAS build error When Installing Dependencies in React Native with Expo
3:40
Support React Native Android 16KB Page Size | Fix Build Failed Error | NDK
1:28
Solving expo build failed for task ':app:bundleReleaseJsAndAssets' in Your React Native App
1:43
Resolving the react-native-screens:compileDebugKotlin FAILED Error in Your React Navigation Project
1:21
Resolving the react-native-webview Build Operation Error in React Native 0.72.0